Reaction Details
TargetD(2) dopamine receptor
LigandBDBM50124935
Substrate/Competitorn/a
Meas. Tech.ChEBML_61299
Ki 26±n/a nM
Citation Zhao, HZhang, XHodgetts, KThurkauf, AHammer, JChandrasekhar, JKieltyka, ABrodbeck, RRachwal, SPrimus, RManly, C Design, synthesis, and discovery of 5-piperazinyl-1,2,6,7-tetrahydro-5H-azepino[3,2,1-hi]indol-4-one derivatives: a novel series of mixed dopamine D2/D4 receptor antagonist. Bioorg Med Chem Lett13:701-4 (2003) D(2) dopamine receptor
Name:D(2) dopamine receptor
Type:Cell-surface receptors
Mol. Mass.:50647.10
Organism:Homo sapiens (Human)
Description:P14416
Residue:443
BDBM50124935
NameBDBM50124935
Synonyms:2-Methyl-5-[4-(4-methyl-benzyl)-piperazin-1-yl]-1,2,6,7-tetrahydro-5H-azepino[3,2,1-hi]indol-4-one | CHEMBL345438
TypeSmall organic molecule
Emp. Form.C25H31N3O
Mol. Mass.389.5331
SMILESCC1Cc2cccc3CCC(N4CCN(Cc5ccc(C)cc5)CC4)C(=O)N1c23