Reaction Details
TargetD(4) dopamine receptor
LigandBDBM50092054
Substrate/Competitorn/a
Meas. Tech.ChEBML_60995
Ki 1511±n/a nM
Citation Zhao, HZhang, XHodgetts, KThurkauf, AHammer, JChandrasekhar, JKieltyka, ABrodbeck, RRachwal, SPrimus, RManly, C Design, synthesis, and discovery of 5-piperazinyl-1,2,6,7-tetrahydro-5H-azepino[3,2,1-hi]indol-4-one derivatives: a novel series of mixed dopamine D2/D4 receptor antagonist. Bioorg Med Chem Lett13:701-4 (2003) D(4) dopamine receptor
Name:D(4) dopamine receptor
Type:Enzyme
Mol. Mass.:48373.19
Organism:Homo sapiens (Human)
Description:P21917
Residue:419
BDBM50092054
NameBDBM50092054
Synonyms:3-[4-(4-Chloro-benzyl)-piperazin-1-yl]-1-ethyl-1,3,4,5-tetrahydro-benzo[b]azepin-2-one | CHEMBL67414
TypeSmall organic molecule
Emp. Form.C23H28ClN3O
Mol. Mass.397.941
SMILESCCN1c2ccccc2CCC(N2CCN(Cc3ccc(Cl)cc3)CC2)C1=O