Reaction Details
TargetD(2) dopamine receptor
LigandBDBM50124936
Substrate/Competitorn/a
Meas. Tech.ChEBML_61299
Ki 165±n/a nM
Citation Zhao, HZhang, XHodgetts, KThurkauf, AHammer, JChandrasekhar, JKieltyka, ABrodbeck, RRachwal, SPrimus, RManly, C Design, synthesis, and discovery of 5-piperazinyl-1,2,6,7-tetrahydro-5H-azepino[3,2,1-hi]indol-4-one derivatives: a novel series of mixed dopamine D2/D4 receptor antagonist. Bioorg Med Chem Lett13:701-4 (2003) D(2) dopamine receptor
Name:D(2) dopamine receptor
Type:Cell-surface receptors
Mol. Mass.:50647.10
Organism:Homo sapiens (Human)
Description:P14416
Residue:443
BDBM50124936
NameBDBM50124936
Synonyms:2,2-Dimethyl-5-[4-(4-methyl-benzyl)-piperazin-1-yl]-1,2,6,7-tetrahydro-5H-azepino[3,2,1-hi]indol-4-one | CHEMBL351989
TypeSmall organic molecule
Emp. Form.C26H33N3O
Mol. Mass.403.5597
SMILESCc1ccc(CN2CCN(CC2)C2CCc3cccc4CC(C)(C)N(c34)C2=O)cc1