Reaction Details
TargetD(4) dopamine receptor
LigandBDBM50124938
Substrate/Competitorn/a
Meas. Tech.ChEBML_60995
Ki 29±n/a nM
Citation Zhao, HZhang, XHodgetts, KThurkauf, AHammer, JChandrasekhar, JKieltyka, ABrodbeck, RRachwal, SPrimus, RManly, C Design, synthesis, and discovery of 5-piperazinyl-1,2,6,7-tetrahydro-5H-azepino[3,2,1-hi]indol-4-one derivatives: a novel series of mixed dopamine D2/D4 receptor antagonist. Bioorg Med Chem Lett13:701-4 (2003) D(4) dopamine receptor
Name:D(4) dopamine receptor
Type:Enzyme
Mol. Mass.:48373.19
Organism:Homo sapiens (Human)
Description:P21917
Residue:419
BDBM50124938
NameBDBM50124938
Synonyms:5-[4-(5-Chloro-2-methoxy-benzyl)-piperazin-1-yl]-2,2-dimethyl-1,2,6,7-tetrahydro-5H-azepino[3,2,1-hi]indol-4-one | CHEMBL354699
TypeSmall organic molecule
Emp. Form.C26H32ClN3O2
Mol. Mass.454.004
SMILESCOc1ccc(Cl)cc1CN1CCN(CC1)C1CCc2cccc3CC(C)(C)N(c23)C1=O