Reaction Details
TargetAlpha-1A/Alpha-1B/Alpha-1D adrenergic receptor
LigandBDBM50092054
Substrate/Competitorn/a
Meas. Tech.ChEMBL_34449 (CHEMBL651981)
Ki 2678±n/a nM
Citation Zhao, HZhang, XHodgetts, KThurkauf, AHammer, JChandrasekhar, JKieltyka, ABrodbeck, RRachwal, SPrimus, RManly, C Design, synthesis, and discovery of 5-piperazinyl-1,2,6,7-tetrahydro-5H-azepino[3,2,1-hi]indol-4-one derivatives: a novel series of mixed dopamine D2/D4 receptor antagonist. Bioorg Med Chem Lett13:701-4 (2003) Alpha-1A/Alpha-1B/Alpha-1D adrenergic receptor
Name:Alpha-1A/Alpha-1B/Alpha-1D adrenergic receptor
Type:n/a
Mol. Mass.:n/a
Description:ASSAY_ID of EBI is 303470
Components:This complex has 3 components.
Component 1
Name:Alpha-1B adrenergic receptor
Synonyms:ADA1B_RAT Alpha 1B-adrenoceptor Alpha adrenergic receptor 1A and 1B Alpha-1Adrenoceptor Alpha-1B adrenoreceptor | adrenergic Alpha1B
Type:G Protein-Coupled Receptor (GPCR)
Mol. Mass.:56606.71
Organism:Rattus norvegicus (rat)
Description:Receptor binding assays were performed using rat cortical membranes.
Residue:515
Component 2
Name:Alpha-1A adrenergic receptor
Synonyms:ADA1A_RAT Adra1c Alpha-1A adrenoceptor Alpha-1C adrenergic receptor | adrenergic Alpha1A
Type:Protein
Mol. Mass.:51620.15
Organism:Rattus norvegicus (Rat)
Description:P43140
Residue:466
Component 3
Name:Alpha-1D adrenergic receptor
Synonyms:ADA1D_RAT Adra1d Alpha-1D adrenergic receptor | Serotonin 1a (5-HT1a) receptor/Adrenergic receptor alpha-1
Type:Protein
Mol. Mass.:59375.97
Organism:Rattus norvegicus (Rat)
Description:P23944
Residue:561
BDBM50092054
NameBDBM50092054
Synonyms:3-[4-(4-Chloro-benzyl)-piperazin-1-yl]-1-ethyl-1,3,4,5-tetrahydro-benzo[b]azepin-2-one | CHEMBL67414
TypeSmall organic molecule
Emp. Form.C23H28ClN3O
Mol. Mass.397.941
SMILESCCN1c2ccccc2CCC(N2CCN(Cc3ccc(Cl)cc3)CC2)C1=O