Reaction Details
Target5'-nucleotidase
LigandBDBM50561936
Substrate/Competitorn/a
Meas. Tech.ChEMBL_2076335 (CHEMBL4731869)
IC50 190±n/a nM
Citation Ashraf, AShafiq, ZKhan Jadoon, MSTahir, MNPelletier, JSevigny, JYaqub, MIqbal, J Synthesis, Characterization, and  ACS Med Chem Lett11:2397-2405 (2020) 
 
5'-nucleotidase
Name:5'-nucleotidase
Type:Enzyme
Mol. Mass.:63971.44
Organism:Rattus norvegicus (Rat)
Description:P21588
Residue:576
BDBM50561936
NameBDBM50561936
Synonyms:CHEMBL4741833
TypeSmall organic molecule
Emp. Form.C16H14N6O
Mol. Mass.306.322
SMILESCN1C(=O)C2(c3ccccc13)c1c(C)[nH]nc1NC(N)=C2C#N