Reaction Details
TargetEndothelin-1 receptor
LigandBDBM50125347
Substrate/Competitorn/a
Meas. Tech.ChEBML_65644
Ki 14±n/a nM
Citation Tellew, JEBaska, RABeyer, SMCarlson, KECornelius, LAFadnis, LGu, ZKunst, BLKowala, MCMonshizadegan, HMurugesan, NRyan, CSValentine, MTYang, YMacor, JE Discovery of 4'-[(imidazol-1-yl)methyl]biphenyl-2-sulfonamides as dual endothelin/angiotensin II receptor antagonists. Bioorg Med Chem Lett13:1093-6 (2003) Endothelin-1 receptor
Name:Endothelin-1 receptor
Type:Enzyme Catalytic Domain
Mol. Mass.:48736.88
Organism:Homo sapiens (Human)
Description:P25101
Residue:427
BDBM50125347
NameBDBM50125347
Synonyms:2'-Hydroxymethyl-4'-(8-oxo-2-propyl-5,6,7,8-tetrahydro-4H-cycloheptaimidazol-1-ylmethyl)-biphenyl-2-sulfonic acid (3,4-dimethyl-isoxazol-5-yl)-amide | CHEMBL11528
TypeSmall organic molecule
Emp. Form.C30H34N4O5S
Mol. Mass.562.68
SMILESCCCc1nc2CCCCC(=O)c2n1Cc1ccc(c(CO)c1)-c1ccccc1S(=O)(=O)Nc1onc(C)c1C