Reaction Details
TargetMelatonin receptor type 1B
LigandBDBM50035179
Substrate/Competitorn/a
Meas. Tech.ChEMBL_105261 (CHEMBL710751)
Ki 0.27±n/a nM
Citation Descamps-François, CYous, SChavatte, PAudinot, VBonnaud, ABoutin, JADelagrange, PBennejean, CRenard, PLesieur, D Design and synthesis of naphthalenic dimers as selective MT1 melatoninergic ligands. J Med Chem46:1127-9 (2003) 
 
Melatonin receptor type 1B
Name:Melatonin receptor type 1B
Type:Enzyme
Mol. Mass.:40203.54
Organism:Homo sapiens (Human)
Description:P49286
Residue:362
BDBM50035179
NameBDBM50035179
Synonyms:Agomelatine N-[2-(7-Methoxy-naphthalen-1-yl)-ethyl]-acetamide S 20098 US11091445, Compound code IA2-76
TypeSmall organic molecule
Emp. Form.C15H17NO2
Mol. Mass.243.301
SMILESCOc1ccc2cccc(CCNC(C)=O)c2c1