Reaction Details
TargetPolymerase acidic protein
LigandBDBM50409783
Substrate/Competitorn/a
Meas. Tech.ChEMBL_64976 (CHEMBL675561)
IC50 100±n/a nM
Citation Parkes, KEErmert, PFässler, JIves, JMartin, JAMerrett, JHObrecht, DWilliams, GKlumpp, K Use of a pharmacophore model to discover a new class of influenza endonuclease inhibitors. J Med Chem46:1153-64 (2003) 
 
Polymerase acidic protein
Name:Polymerase acidic protein
Type:PROTEIN
Mol. Mass.:82573.84
Organism:Hepatitis C virus
Description:ChEMBL_64976
Residue:716
BDBM50409783
NameBDBM50409783
Synonyms:CHEMBL1626982 CHEMBL2068711 CHEMBL2068718 | CHEMBL2068732
TypeSmall organic molecule
Emp. Form.C23H22ClNO4
Mol. Mass.411.879
SMILES[O-]C(=O)C(=O)[CH-]C(=O)C1(Cc2ccc(Cl)cc2)CCN(Cc2ccccc2)CC1