Reaction Details
TargetTransient receptor potential cation channel subfamily V member 1
LigandBDBM50054471
Substrate/Competitorn/a
Meas. Tech.ChEMBL_2079017 (CHEMBL4734808)
EC50 50±n/a nM
Citation Å Nilsson, JLMallet, CShionoya, KBlomgren, ASundin, APGrundemar, LBoudieu, LBlomqvist, AEschalier, ANilsson, UJZygmunt, PM Paracetamol analogues conjugated by FAAH induce TRPV1-mediated antinociception without causing acute liver toxicity. Eur J Med Chem213:0 (2021) 
 
Transient receptor potential cation channel subfamily V member 1
Name:Transient receptor potential cation channel subfamily V member 1
Type:Transient Receptor
Mol. Mass.:94956.12
Organism:Rattus norvegicus (rat)
Description:O35433
Residue:838
BDBM50054471
NameBDBM50054471
Synonyms:(5Z,8Z)-Icosa-5,8,11,14-tetraenoic acid (4-hydroxy-phenyl)-amide (5Z,8Z,11Z,14Z)-N-(4-hydroxyphenyl)icosa-5,8,11,14-tetraenamide AM-404 CHEMBL39878 N-(4-hydroxyphenyl)-(5Z,8Z,11Z,14Z)-icosatetra-5,8,11,14-enamide cid_6604822
TypeSmall organic molecule
Emp. Form.C26H37NO2
Mol. Mass.395.5775
SMILESCCCCC\C=C/C\C=C/C\C=C/C\C=C/CCCC(=O)Nc1ccc(O)cc1