Reaction Details
TargetInosine-5'-monophosphate dehydrogenase 2
LigandBDBM50123324
Substrate/Competitorn/a
Meas. Tech.ChEBML_234
IC50 8±n/a nM
Citation Watterson, SHDhar, TGBallentine, SKShen, ZBarrish, JCCheney, DFleener, CARouleau, KATownsend, RHollenbaugh, DLIwanowicz, EJ Novel indole-based inhibitors of IMPDH: introduction of hydrogen bond acceptors at indole C-3. Bioorg Med Chem Lett13:1273-6 (2003) Inosine-5'-monophosphate dehydrogenase 2
Name:Inosine-5'-monophosphate dehydrogenase 2
Type:Enzyme
Mol. Mass.:55806.87
Organism:Homo sapiens (Human)
Description:Recombinant IMPDH2 expressed in E. coli.
Residue:514
BDBM50123324
NameBDBM50123324
Synonyms:7-Methoxy-6-oxazol-5-yl-2-phenyl-1H-quinolin-4-one | CHEMBL23843
TypeSmall organic molecule
Emp. Form.C19H14N2O3
Mol. Mass.318.3261
SMILESCOc1cc2nc(cc(O)c2cc1-c1cnco1)-c1ccccc1