Reaction Details
TargetGeranylgeranyl transferase type-1 subunit beta
LigandBDBM50126035
Substrate/Competitorn/a
Meas. Tech.ChEBML_71792
IC50 10±n/a nM
Citation Lin, NHWang, LCohen, JGu, WZFrost, DZhang, HRosenberg, SSham, H Synthesis and biological evaluation of 4-[3-biphenyl-2-yl-1-hydroxy-1-(3-methyl-3H-imidazol-4-yl)-prop-2-ynyl]-1-yl-benzonitrile as novel farnesyltransferase inhibitor. Bioorg Med Chem Lett13:1293-6 (2003) Geranylgeranyl transferase type-1 subunit beta
Name:Geranylgeranyl transferase type-1 subunit beta
Type:n/a
Mol. Mass.:42369.84
Organism:Homo sapiens (Human)
Description:n/a
Residue:377
BDBM50126035
NameBDBM50126035
Synonyms:4-[3-(4-Cyano-phenyl)-1-hydroxy-1-(3-methyl-3H-imidazol-4-yl)-prop-2-ynyl]-2-naphthalen-1-yl-benzonitrile | CHEMBL24733
TypeSmall organic molecule
Emp. Form.C31H20N4O
Mol. Mass.464.5167
SMILESCn1cncc1C(O)(C#Cc1ccc(cc1)C#N)c1ccc(C#N)c(c1)-c1cccc2ccccc12