Reaction Details
TargetGeranylgeranyl transferase type-1 subunit beta
LigandBDBM50126041
Substrate/Competitorn/a
Meas. Tech.ChEMBL_71792 (CHEMBL686003)
IC50 4100±n/a nM
Citation Lin, NHWang, LCohen, JGu, WZFrost, DZhang, HRosenberg, SSham, H Synthesis and biological evaluation of 4-[3-biphenyl-2-yl-1-hydroxy-1-(3-methyl-3H-imidazol-4-yl)-prop-2-ynyl]-1-yl-benzonitrile as novel farnesyltransferase inhibitor. Bioorg Med Chem Lett13:1293-6 (2003) Geranylgeranyl transferase type-1 subunit beta
Name:Geranylgeranyl transferase type-1 subunit beta
Type:n/a
Mol. Mass.:42369.84
Organism:Homo sapiens (Human)
Description:n/a
Residue:377
BDBM50126041
NameBDBM50126041
Synonyms:6-[3-(4-Cyano-phenyl)-3-hydroxy-3-(3-methyl-3H-imidazol-4-yl)-prop-1-ynyl]-3''-methoxy-biphenyl-3-carbonitrile CHEMBL22702
TypeSmall organic molecule
Emp. Form.C28H20N4O2
Mol. Mass.444.484
SMILESCOc1cccc(c1)-c1cc(ccc1C#CC(O)(c1cncn1C)c1ccc(cc1)C#N)C#N