Reaction Details
TargetAcetyl-CoA carboxylase 1
LigandBDBM50562563
Substrate/Competitorn/a
Meas. Tech.ChEMBL_2079230 (CHEMBL4735021)
IC50 1.3±n/a nM
Citation Huang, TWu, XYan, SLiu, TYin, X Synthesis and in vitro evaluation of novel spiroketopyrazoles as acetyl-CoA carboxylase inhibitors and potential antitumor agents. Eur J Med Chem212:0 (2021) 
 
Acetyl-CoA carboxylase 1
Name:Acetyl-CoA carboxylase 1
Type:Protein
Mol. Mass.:265543.22
Organism:Homo sapiens (Human)
Description:Q13085
Residue:2346
BDBM50562563
NameBDBM50562563
Synonyms:CHEMBL4777068
TypeSmall organic molecule
Emp. Form.C30H31N5O3
Mol. Mass.509.5988
SMILESCC(C)(C)n1cc2OC3(CCN(CC3)C(=O)c3cc(nc4ccccc34)-c3ccc(N)cc3)CC(=O)c2n1