Reaction Details
TargetProtein farnesyltransferase subunit beta/geranylgeranyltransferase type-1 subunit alpha
LigandBDBM50126336
Substrate/Competitorn/a
Meas. Tech.ChEMBL_69849 (CHEMBL680439)
IC50 0.370000±n/a nM
Citation Curtin, MLFlorjancic, ASCohen, JGu, WZFrost, DJMuchmore, SWSham, HL Novel and selective imidazole-containing biphenyl inhibitors of protein farnesyltransferase. Bioorg Med Chem Lett13:1367-71 (2003) Protein farnesyltransferase subunit beta/geranylgeranyltransferase type-1 subunit alpha
Name:Protein farnesyltransferase subunit beta/geranylgeranyltransferase type-1 subunit alpha
Type:Protein Complex
Mol. Mass.:n/a
Description:Purified bovine brain FTase.
Components:This complex has 2 components.
Component 1
Name:Protein farnesyltransferase/geranylgeranyltransferase type-1 subunit alpha
Synonyms:CAAX farnesyltransferase alpha subunit FNTA_BOVIN GGTase-I-alpha Protein Farnesyltransferase (PFT) Chain A Protein farnesyltransferase/geranylgeranyltransferase type I alpha subunit Type I protein geranyl-geranyltransferase alpha subunit
Type:Enzyme
Mol. Mass.:43827.38
Organism:Bos taurus (bovine)
Description:The enzyme was purified from a bovine brain homogenate by sequential ammonium sulfate fractionation and affinity chromatography.
Residue:375
Component 2
Name:Protein farnesyltransferase subunit beta
Synonyms:CAAX farnesyltransferase subunit beta FNTB_BOVIN Protein farnesyltransferase Protein farnesyltransferase subunit beta Ras proteins prenyltransferase subunit beta
Type:Enzyme Subunit
Mol. Mass.:48758.49
Organism:Bos taurus (bovine)
Description:Protein farnesyltransferase subunit beta
Residue:437
BDBM50126336
NameBDBM50126336
Synonyms:4-{[(4-Cyano-3-naphthalen-1-yl-phenyl)-(3-methyl-3H-imidazol-4-ylmethyl)-amino]-methyl}-pyridine-2-carbonitrile | CHEMBL282959
TypeSmall organic molecule
Emp. Form.C29H22N6
Mol. Mass.454.5252
SMILESCn1cncc1CN(Cc1ccnc(c1)C#N)c1ccc(C#N)c(c1)-c1cccc2ccccc12