Reaction Details
TargetProthrombin
LigandBDBM50126486
Substrate/Competitorn/a
Meas. Tech.ChEBML_208513
Ki 2.1±n/a nM
Citation Sanderson, PECutrona, KJSavage, KLNaylor-Olsen, AMBickel, DJBohn, DLClayton, FCKrueger, JALewis, SDLucas, BJLyle, EAWallace, AAWelsh, DCYan, Y 3-amino-4-sulfonylpyridinone acetamide and related pyridothiadiazine thrombin inhibitors. Bioorg Med Chem Lett13:1441-4 (2003) Prothrombin
Name:Prothrombin
Type:Protein
Mol. Mass.:70029.57
Organism:Homo sapiens (Human)
Description:P00734
Residue:622
BDBM50126486
NameBDBM50126486
Synonyms:CHEMBL32549 | N-(6-Amino-2-methyl-pyridin-3-ylmethyl)-2-(2-cyclopropylmethyl-7-methyl-1,1,5-trioxo-1,3,4,5-tetrahydro-2H-1lambda*6*-thia-2,4,6-triaza-naphthalen-6-yl)-acetamide
TypeSmall organic molecule
Emp. Form.C20H26N6O4S
Mol. Mass.446.523
SMILESCc1cc2c(NCN(CC3CC3)S2(=O)=O)c(=O)n1CC(=O)NCc1ccc(N)nc1C