Reaction Details
TargetProthrombin
LigandBDBM50126488
Substrate/Competitorn/a
Meas. Tech.ChEBML_208513
Ki 3.8±n/a nM
Citation Sanderson, PECutrona, KJSavage, KLNaylor-Olsen, AMBickel, DJBohn, DLClayton, FCKrueger, JALewis, SDLucas, BJLyle, EAWallace, AAWelsh, DCYan, Y 3-amino-4-sulfonylpyridinone acetamide and related pyridothiadiazine thrombin inhibitors. Bioorg Med Chem Lett13:1441-4 (2003) Prothrombin
Name:Prothrombin
Type:Protein
Mol. Mass.:70029.57
Organism:Homo sapiens (Human)
Description:P00734
Residue:622
BDBM50126488
NameBDBM50126488
Synonyms:2-(3-Amino-4-benzenesulfonyl-6-methyl-2-oxo-2H-pyridin-1-yl)-N-(6-amino-2-methyl-pyridin-3-ylmethyl)-acetamide | CHEMBL32531
TypeSmall organic molecule
Emp. Form.C21H23N5O4S
Mol. Mass.441.503
SMILESCc1nc(N)ccc1CNC(=O)Cn1c(C)cc(c(N)c1=O)S(=O)(=O)c1ccccc1