Reaction Details
TargetProthrombin
LigandBDBM50126635
Substrate/Competitorn/a
Meas. Tech.ChEBML_208521
Ki 12±n/a nM
Citation Tomczuk, BLu, TSoll, RMFedde, CWang, AMurphy, LCrysler, CDasgupta, MEisennagel, SSpurlino, JBone, R Oxyguanidines: application to non-peptidic phenyl-based thrombin inhibitors. Bioorg Med Chem Lett13:1495-8 (2003) Prothrombin
Name:Prothrombin
Type:Protein
Mol. Mass.:70029.57
Organism:Homo sapiens (Human)
Description:P00734
Residue:622
BDBM50126635
NameBDBM50126635
Synonyms:3-[3-({[(Z)-amino(imino)methyl]amino}oxy)ethoxy]-5-methylphenyl 2-methylsulfonylbenzenesulfonate CHEMBL37637
TypeSmall organic molecule
Emp. Form.C18H23N3O7S2
Mol. Mass.457.521
SMILESCc1cc(OCCCONC(N)=N)cc(OS(=O)(=O)c2ccccc2S(C)(=O)=O)c1