Reaction Details
TargetProthrombin
LigandBDBM50126640
Substrate/Competitorn/a
Meas. Tech.ChEBML_208521
Ki 4.8±n/a nM
Citation Tomczuk, BLu, TSoll, RMFedde, CWang, AMurphy, LCrysler, CDasgupta, MEisennagel, SSpurlino, JBone, R Oxyguanidines: application to non-peptidic phenyl-based thrombin inhibitors. Bioorg Med Chem Lett13:1495-8 (2003) Prothrombin
Name:Prothrombin
Type:Protein
Mol. Mass.:70029.57
Organism:Homo sapiens (Human)
Description:P00734
Residue:622
BDBM50126640
NameBDBM50126640
Synonyms:3-[3-({[(Z)-amino(imino)methyl]amino}oxy)propoxy]-5-methylphenyl 2-phenylsulfonylbenzenesulfonate | CHEMBL37884
TypeSmall organic molecule
Emp. Form.C23H25N3O7S2
Mol. Mass.519.591
SMILESCc1cc(OCCCONC(N)=N)cc(OS(=O)(=O)c2ccccc2S(=O)(=O)c2ccccc2)c1