Reaction Details
TargetProthrombin
LigandBDBM50126647
Substrate/Competitorn/a
Meas. Tech.ChEBML_208521
Ki 2.1±n/a nM
Citation Tomczuk, BLu, TSoll, RMFedde, CWang, AMurphy, LCrysler, CDasgupta, MEisennagel, SSpurlino, JBone, R Oxyguanidines: application to non-peptidic phenyl-based thrombin inhibitors. Bioorg Med Chem Lett13:1495-8 (2003) Prothrombin
Name:Prothrombin
Type:Protein
Mol. Mass.:70029.57
Organism:Homo sapiens (Human)
Description:P00734
Residue:622
BDBM50126647
NameBDBM50126647
Synonyms:3-[3-({[(Z)-amino(imino)methyl]amino}oxy)propoxy]-5-methylphenyl 2-chlorobenzenesulfonate | CHEMBL36272
TypeSmall organic molecule
Emp. Form.C17H20ClN3O5S
Mol. Mass.413.876
SMILESCc1cc(OCCCONC(N)=N)cc(OS(=O)(=O)c2ccccc2Cl)c1