Reaction Details
TargetKappa-type opioid receptor
LigandBDBM50126656
Substrate/Competitorn/a
Meas. Tech.ChEMBL_145987 (CHEMBL750581)
Ki 8.4±n/a nM
Citation Vig, BSMurray, TFAldrich, JV A novel N-terminal cyclic dynorphin A analogue cyclo(N,5)[Trp(3),Trp(4),Glu(5)] dynorphin A-(1-11)NH(2) that lacks the basic N-terminus. J Med Chem46:1279-82 (2003) 
 
Kappa-type opioid receptor
Name:Kappa-type opioid receptor
Type:G Protein-Coupled Receptor (GPCR)
Mol. Mass.:42744.99
Organism:Cavia porcellus (domestic guinea pig)
Description:P41144
Residue:380
BDBM50126656
NameBDBM50126656
Synonyms:CHEMBL263595 | Compound [Gly2]Venorphin
TypeSmall organic molecule
Emp. Form.C73H108N24O13
Mol. Mass.1529.7916
SMILESCC(C)C[C@H](NC(=O)[C@H](Cc1c[nH]c2ccccc12)NC(=O)[C@H](Cc1c[nH]c2ccccc12)NC(=O)CNC(=O)[C@H](Cc1ccc(O)cc1)NC(C)=O)C(=O)N[C@@H](CCCNC(N)=N)C(=O)N[C@@H](CCCNC(N)=N)C(=O)N[C@@H](C)C(=O)N[C@@H](CCCNC(N)=N)C(=O)N1CCC[C@H]1C(=O)N[C@@H](CCCCN)C(N)=O