Reaction Details
TargetcAMP-dependent protein kinase catalytic subunit alpha/beta/gamma
LigandBDBM50126732
Substrate/Competitorn/a
Meas. Tech.ChEMBL_161916 (CHEMBL767995)
IC50>100000±n/a nM
Citation Goldberg, DRButz, TCardozo, MGEckner, RJHammach, AHuang, JJakes, SKapadia, SKashem, MLukas, SMorwick, TMPanzenbeck, MPatel, UPav, SPeet, GWPeterson, JDProkopowicz, ASSnow, RJSellati, RTakahashi, HTan, JTschantz, MAWang, XJWang, YWolak, JXiong, PMoss, N Optimization of 2-phenylaminoimidazo[4,5-h]isoquinolin-9-ones: orally active inhibitors of lck kinase. J Med Chem46:1337-49 (2003) 
 
cAMP-dependent protein kinase catalytic subunit alpha/beta/gamma
Name:cAMP-dependent protein kinase catalytic subunit alpha/beta/gamma
Synonyms:cAMP-dependent protein kinase (PKA)
Type:n/a
Mol. Mass.:n/a
Description:ASSAY_ID of ChEMBL is 217489
Components:This complex has 3 components.
Component 1
Name:cAMP-dependent protein kinase catalytic subunit beta
Type:PROTEIN
Mol. Mass.:40631.25
Organism:Homo sapiens (Human)
Description:ChEMBL_586348
Residue:351
Component 2
Name:cAMP-dependent protein kinase catalytic subunit alpha
Synonyms:KAPCA_HUMAN PKACA cAMP-dependent protein kinase (PKA) cAMP-dependent protein kinase catalytic subunit alpha cAMP-dependent protein kinase catalytic subunit alpha (PKACA) cAMP-dependent protein kinase catalytic subunit alpha isoform 1 | cAMP-dependent protein kinase, alpha-catalytic subunit
Type:Enzyme Catalytic Subunit
Mol. Mass.:40598.73
Organism:Homo sapiens (Human)
Description:n/a
Residue:351
Component 3
Name:cAMP-dependent protein kinase catalytic subunit gamma
Synonyms:KAPCG_HUMAN PRKACG cAMP-dependent protein kinase catalytic subunit gamma
Type:PROTEIN
Mol. Mass.:40442.03
Organism:Homo sapiens (Human)
Description:ChEMBL_104720
Residue:351
BDBM50126732
NameBDBM50126732
Synonyms:2-(2,6-Dichloro-phenylamino)-7-(3-diethylamino-propenyl)-1,6-dimethyl-1,8-dihydro-imidazo[4,5-h]isoquinolin-9-one | CHEMBL281957
TypeSmall organic molecule
Emp. Form.C25H27Cl2N5O
Mol. Mass.484.421
SMILESCCN(CC)CC=Cc1[nH]c(=O)c2c3n(C)c(Nc4c(Cl)cccc4Cl)nc3ccc2c1C