Reaction Details
TargetTyrosine-protein kinase Lck
LigandBDBM50126733
Substrate/Competitorn/a
Meas. Tech.ChEMBL_221314 (CHEMBL841204)
IC50 770.0±n/a nM
Citation Goldberg, DRButz, TCardozo, MGEckner, RJHammach, AHuang, JJakes, SKapadia, SKashem, MLukas, SMorwick, TMPanzenbeck, MPatel, UPav, SPeet, GWPeterson, JDProkopowicz, ASSnow, RJSellati, RTakahashi, HTan, JTschantz, MAWang, XJWang, YWolak, JXiong, PMoss, N Optimization of 2-phenylaminoimidazo[4,5-h]isoquinolin-9-ones: orally active inhibitors of lck kinase. J Med Chem46:1337-49 (2003) 
 
Tyrosine-protein kinase Lck
Name:Tyrosine-protein kinase Lck
Type:n/a
Mol. Mass.:57987.83
Organism:Homo sapiens (Human)
Description:P06239
Residue:509
BDBM50126733
NameBDBM50126733
Synonyms:2-(2,6-Dichloro-phenylamino)-7-hydroxymethyl-1,6-dimethyl-1,8-dihydro-imidazo[4,5-h]isoquinolin-9-one | CHEMBL27302
TypeSmall organic molecule
Emp. Form.C19H16Cl2N4O2
Mol. Mass.403.262
SMILESCc1c(CO)[nH]c(=O)c2c3n(C)c(Nc4c(Cl)cccc4Cl)nc3ccc12