Reaction Details
TargetTyrosine-protein kinase Lck
LigandBDBM50126740
Substrate/Competitorn/a
Meas. Tech.ChEMBL_221314 (CHEMBL841204)
IC50 460±n/a nM
Citation Goldberg, DRButz, TCardozo, MGEckner, RJHammach, AHuang, JJakes, SKapadia, SKashem, MLukas, SMorwick, TMPanzenbeck, MPatel, UPav, SPeet, GWPeterson, JDProkopowicz, ASSnow, RJSellati, RTakahashi, HTan, JTschantz, MAWang, XJWang, YWolak, JXiong, PMoss, N Optimization of 2-phenylaminoimidazo[4,5-h]isoquinolin-9-ones: orally active inhibitors of lck kinase. J Med Chem46:1337-49 (2003) 
 
Tyrosine-protein kinase Lck
Name:Tyrosine-protein kinase Lck
Type:n/a
Mol. Mass.:57987.83
Organism:Homo sapiens (Human)
Description:P06239
Residue:509
BDBM50126740
NameBDBM50126740
Synonyms:2-[2-(2,6-Dichloro-phenylamino)-1,7-dimethyl-9-oxo-8,9-dihydro-1H-imidazo[4,5-h]isoquinolin-6-yl]-N-ethyl-acetamide | CHEMBL26864
TypeSmall organic molecule
Emp. Form.C22H21Cl2N5O2
Mol. Mass.458.34
SMILESCCNC(=O)Cc1c(C)[nH]c(=O)c2c3n(C)c(Nc4c(Cl)cccc4Cl)nc3ccc12