Reaction Details
TargetTyrosine-protein kinase Lck
LigandBDBM50126739
Substrate/Competitorn/a
Meas. Tech.ChEMBL_221314 (CHEMBL841204)
IC50 2±n/a nM
Citation Goldberg, DRButz, TCardozo, MGEckner, RJHammach, AHuang, JJakes, SKapadia, SKashem, MLukas, SMorwick, TMPanzenbeck, MPatel, UPav, SPeet, GWPeterson, JDProkopowicz, ASSnow, RJSellati, RTakahashi, HTan, JTschantz, MAWang, XJWang, YWolak, JXiong, PMoss, N Optimization of 2-phenylaminoimidazo[4,5-h]isoquinolin-9-ones: orally active inhibitors of lck kinase. J Med Chem46:1337-49 (2003) 
 
Tyrosine-protein kinase Lck
Name:Tyrosine-protein kinase Lck
Type:n/a
Mol. Mass.:57987.83
Organism:Homo sapiens (Human)
Description:P06239
Residue:509
BDBM50126739
NameBDBM50126739
Synonyms:2-(2,6-Dichloro-phenylamino)-1,6-dimethyl-7-(3-pyrrolidin-1-yl-propenyl)-1,8-dihydro-imidazo[4,5-h]isoquinolin-9-one | CHEMBL432089
TypeSmall organic molecule
Emp. Form.C25H25Cl2N5O
Mol. Mass.482.405
SMILESCc1c(C=CCN2CCCC2)[nH]c(=O)c2c3n(C)c(Nc4c(Cl)cccc4Cl)nc3ccc12