Reaction Details
TargetTyrosine-protein kinase Lck
LigandBDBM50126750
Substrate/Competitorn/a
Meas. Tech.ChEMBL_221314 (CHEMBL841204)
IC50>2500±n/a nM
Citation Goldberg, DRButz, TCardozo, MGEckner, RJHammach, AHuang, JJakes, SKapadia, SKashem, MLukas, SMorwick, TMPanzenbeck, MPatel, UPav, SPeet, GWPeterson, JDProkopowicz, ASSnow, RJSellati, RTakahashi, HTan, JTschantz, MAWang, XJWang, YWolak, JXiong, PMoss, N Optimization of 2-phenylaminoimidazo[4,5-h]isoquinolin-9-ones: orally active inhibitors of lck kinase. J Med Chem46:1337-49 (2003) 
 
Tyrosine-protein kinase Lck
Name:Tyrosine-protein kinase Lck
Type:n/a
Mol. Mass.:57987.83
Organism:Homo sapiens (Human)
Description:P06239
Residue:509
BDBM50126750
NameBDBM50126750
Synonyms:2-(2,6-Dichloro-phenylamino)-1-ethyl-6,7-dimethyl-1,8-dihydro-imidazo[4,5-h]isoquinolin-9-one | CHEMBL418205
TypeSmall organic molecule
Emp. Form.C20H18Cl2N4O
Mol. Mass.401.289
SMILESCCn1c(Nc2c(Cl)cccc2Cl)nc2ccc3c(C)c(C)[nH]c(=O)c3c12