Reaction Details
TargetTyrosine-protein kinase Lck
LigandBDBM50126729
Substrate/Competitorn/a
Meas. Tech.ChEMBL_221314 (CHEMBL841204)
IC50 360±n/a nM
Citation Goldberg, DRButz, TCardozo, MGEckner, RJHammach, AHuang, JJakes, SKapadia, SKashem, MLukas, SMorwick, TMPanzenbeck, MPatel, UPav, SPeet, GWPeterson, JDProkopowicz, ASSnow, RJSellati, RTakahashi, HTan, JTschantz, MAWang, XJWang, YWolak, JXiong, PMoss, N Optimization of 2-phenylaminoimidazo[4,5-h]isoquinolin-9-ones: orally active inhibitors of lck kinase. J Med Chem46:1337-49 (2003) 
 
Tyrosine-protein kinase Lck
Name:Tyrosine-protein kinase Lck
Type:n/a
Mol. Mass.:57987.83
Organism:Homo sapiens (Human)
Description:P06239
Residue:509
BDBM50126729
NameBDBM50126729
Synonyms:3-[2-(2,6-Dichloro-phenylamino)-1,6-dimethyl-9-oxo-8,9-dihydro-1H-imidazo[4,5-h]isoquinolin-7-yl]-propionic acid methyl ester | CHEMBL284677
TypeSmall organic molecule
Emp. Form.C22H20Cl2N4O3
Mol. Mass.459.325
SMILESCOC(=O)CCc1[nH]c(=O)c2c3n(C)c(Nc4c(Cl)cccc4Cl)nc3ccc2c1C