Reaction Details
TargetTyrosine-protein kinase Lck
LigandBDBM50126736
Substrate/Competitorn/a
Meas. Tech.ChEMBL_221314 (CHEMBL841204)
IC50 26±n/a nM
Citation Goldberg, DRButz, TCardozo, MGEckner, RJHammach, AHuang, JJakes, SKapadia, SKashem, MLukas, SMorwick, TMPanzenbeck, MPatel, UPav, SPeet, GWPeterson, JDProkopowicz, ASSnow, RJSellati, RTakahashi, HTan, JTschantz, MAWang, XJWang, YWolak, JXiong, PMoss, N Optimization of 2-phenylaminoimidazo[4,5-h]isoquinolin-9-ones: orally active inhibitors of lck kinase. J Med Chem46:1337-49 (2003) 
 
Tyrosine-protein kinase Lck
Name:Tyrosine-protein kinase Lck
Type:n/a
Mol. Mass.:57987.83
Organism:Homo sapiens (Human)
Description:P06239
Residue:509
BDBM50126736
NameBDBM50126736
Synonyms:2-(2,6-Dichloro-phenylamino)-4-[(2-hydroxy-ethylamino)-methyl]-1,6,7-trimethyl-1,8-dihydro-imidazo[4,5-h]isoquinolin-9-one | CHEMBL27199
TypeSmall organic molecule
Emp. Form.C22H23Cl2N5O2
Mol. Mass.460.356
SMILESCc1[nH]c(=O)c2c3n(C)c(Nc4c(Cl)cccc4Cl)nc3c(CNCCO)cc2c1C