Reaction Details
TargetN-formyl peptide receptor 2
LigandBDBM50563096
Substrate/Competitorn/a
Meas. Tech.ChEMBL_2081556 (CHEMBL4737347)
EC50 0.250000±n/a nM
Citation Maciuszek, MOrtega-Gomez, AMaas, SLPerretti, MMerritt, ASoehnlein, OChapman, TM Synthesis and evaluation of novel cyclopentane urea FPR2 agonists and their potential application in the treatment of cardiovascular inflammation. Eur J Med Chem214:0 (2021) 
 
N-formyl peptide receptor 2
Name:N-formyl peptide receptor 2
Type:G Protein-Coupled Receptor (GPCR)
Mol. Mass.:38968.35
Organism:Homo sapiens (Human)
Description:P25090
Residue:351
BDBM50563096
NameBDBM50563096
Synonyms:CHEMBL4794375
TypeSmall organic molecule
Emp. Form.C18H19FN2O3
Mol. Mass.330.3535
SMILESCOc1ccc(cc1)[C@@H]1COC[C@@H]1NC(=O)Nc1ccc(F)cc1