Reaction Details
TargetAromatase
LigandBDBM50127286
Substrate/Competitorn/a
Meas. Tech.ChEBML_50700
IC50 62±n/a nM
Citation Marchand, PLe Borgne, MPalzer, MLe Baut, GHartmann, RW Preparation and pharmacological profile of 7-(alpha-azolylbenzyl)-1H-indoles and indolines as new aromatase inhibitors. Bioorg Med Chem Lett13:1553-5 (2003) Aromatase
Name:Aromatase
Type:Enzyme
Mol. Mass.:57888.92
Organism:Homo sapiens (Human)
Description:P11511
Residue:503
BDBM50127286
NameBDBM50127286
Synonyms:1-Ethyl-7-[(4-fluoro-phenyl)-imidazol-1-yl-methyl]-1H-indole | CHEMBL416616
TypeSmall organic molecule
Emp. Form.C20H18FN3
Mol. Mass.319.3754
SMILESCCn1ccc2cccc(C(c3ccc(F)cc3)n3ccnc3)c12