Reaction Details
TargetDelta-type opioid receptor
LigandBDBM50127350
Substrate/Competitorn/a
Meas. Tech.ChEBML_147340
Ki 127±n/a nM
Citation Pagé, DNguyen, NBernard, SCoupal, MGosselin, MLepage, JAdam, LBrown, W New scaffolds in the development of mu opioid-receptor ligands. Bioorg Med Chem Lett13:1585-9 (2003) Delta-type opioid receptor
Name:Delta-type opioid receptor
Type:G Protein-Coupled Receptor (GPCR)
Mol. Mass.:40382.98
Organism:Homo sapiens (Human)
Description:Competition binding assays were carried out using membrane preparations from transfected HN9.10 cells that constitutively expressed the delta opioid receptor.
Residue:372
BDBM50127350
NameBDBM50127350
Synonyms:(S)-3-[(3-Phenyl-ureido)-methyl]-3,4-dihydro-1H-isoquinoline-2-carbothioic acid [(R)-1-(4-hydroxy-2-methoxy-benzyl)-pyrrolidin-2-ylmethyl]-amide | CHEMBL39272
TypeSmall organic molecule
Emp. Form.C31H37N5O3S
Mol. Mass.559.722
SMILESCOc1cc(O)ccc1CN1CCC[C@@H]1CNC(=S)N1Cc2ccccc2C[C@H]1CNC(=O)Nc1ccccc1