Reaction Details
TargetDelta-type opioid receptor
LigandBDBM50127341
Substrate/Competitorn/a
Meas. Tech.ChEBML_147340
Ki 508±n/a nM
Citation Pagé, DNguyen, NBernard, SCoupal, MGosselin, MLepage, JAdam, LBrown, W New scaffolds in the development of mu opioid-receptor ligands. Bioorg Med Chem Lett13:1585-9 (2003) Delta-type opioid receptor
Name:Delta-type opioid receptor
Type:G Protein-Coupled Receptor (GPCR)
Mol. Mass.:40382.98
Organism:Homo sapiens (Human)
Description:Competition binding assays were carried out using membrane preparations from transfected HN9.10 cells that constitutively expressed the delta opioid receptor.
Residue:372
BDBM50127341
NameBDBM50127341
Synonyms:(S)-3-(3-tert-Butyl-ureidomethyl)-3,4-dihydro-1H-isoquinoline-2-carbothioic acid ((R)-1-benzyl-pyrrolidin-2-ylmethyl)-amide | CHEMBL40825
TypeSmall organic molecule
Emp. Form.C28H39N5OS
Mol. Mass.493.707
SMILESCC(C)(C)NC(=O)NC[C@@H]1Cc2ccccc2CN1C(=S)NC[C@H]1CCCN1Cc1ccccc1