Reaction Details
TargetDelta-type opioid receptor
LigandBDBM50127351
Substrate/Competitorn/a
Meas. Tech.ChEBML_147340
Ki 330±n/a nM
Citation Pagé, DNguyen, NBernard, SCoupal, MGosselin, MLepage, JAdam, LBrown, W New scaffolds in the development of mu opioid-receptor ligands. Bioorg Med Chem Lett13:1585-9 (2003) Delta-type opioid receptor
Name:Delta-type opioid receptor
Type:G Protein-Coupled Receptor (GPCR)
Mol. Mass.:40382.98
Organism:Homo sapiens (Human)
Description:Competition binding assays were carried out using membrane preparations from transfected HN9.10 cells that constitutively expressed the delta opioid receptor.
Residue:372
BDBM50127351
NameBDBM50127351
Synonyms:(R)-2-({[(S)-3-(3-tert-Butyl-ureidomethyl)-3,4-dihydro-1H-isoquinoline-2-carbothioyl]-amino}-methyl)-pyrrolidine-1-carboxylic acid tert-butyl ester | CHEMBL38511
TypeSmall organic molecule
Emp. Form.C26H41N5O3S
Mol. Mass.503.7
SMILESCC(C)(C)NC(=O)NC[C@@H]1Cc2ccccc2CN1C(=S)NC[C@H]1CCCN1C(=O)OC(C)(C)C