Reaction Details
TargetDelta-type opioid receptor
LigandBDBM50127353
Substrate/Competitorn/a
Meas. Tech.ChEBML_147340
Ki 140±n/a nM
Citation Pagé, DNguyen, NBernard, SCoupal, MGosselin, MLepage, JAdam, LBrown, W New scaffolds in the development of mu opioid-receptor ligands. Bioorg Med Chem Lett13:1585-9 (2003) Delta-type opioid receptor
Name:Delta-type opioid receptor
Type:G Protein-Coupled Receptor (GPCR)
Mol. Mass.:40382.98
Organism:Homo sapiens (Human)
Description:Competition binding assays were carried out using membrane preparations from transfected HN9.10 cells that constitutively expressed the delta opioid receptor.
Residue:372
BDBM50127353
NameBDBM50127353
Synonyms:(S)-3-[(3-Phenyl-ureido)-methyl]-3,4-dihydro-1H-isoquinoline-2-carbothioic acid [(R)-1-(3-hydroxy-benzyl)-pyrrolidin-2-ylmethyl]-amide | CHEMBL41736
TypeSmall organic molecule
Emp. Form.C30H35N5O2S
Mol. Mass.529.696
SMILESOc1cccc(CN2CCC[C@@H]2CNC(=S)N2Cc3ccccc3C[C@H]2CNC(=O)Nc2ccccc2)c1