Reaction Details
TargetMu-type opioid receptor
LigandBDBM50127339
Substrate/Competitorn/a
Meas. Tech.ChEBML_149319
Ki 137±n/a nM
Citation Pagé, DNguyen, NBernard, SCoupal, MGosselin, MLepage, JAdam, LBrown, W New scaffolds in the development of mu opioid-receptor ligands. Bioorg Med Chem Lett13:1585-9 (2003) Mu-type opioid receptor
Name:Mu-type opioid receptor
Type:G Protein-Coupled Receptor (GPCR)
Mol. Mass.:44789.51
Organism:Homo sapiens (Human)
Description:P35372
Residue:400
BDBM50127339
NameBDBM50127339
Synonyms:(S)-3-(3-tert-Butyl-ureidomethyl)-3,4-dihydro-1H-isoquinoline-2-carbothioic acid ((R)-1-tert-butyl-pyrrolidin-2-ylmethyl)-amide | CHEMBL287981
TypeSmall organic molecule
Emp. Form.C25H41N5OS
Mol. Mass.459.691
SMILESCC(C)(C)NC(=O)NC[C@@H]1Cc2ccccc2CN1C(=S)NC[C@H]1CCCN1C(C)(C)C