Reaction Details
TargetKappa-type opioid receptor
LigandBDBM50127345
Substrate/Competitorn/a
Meas. Tech.ChEBML_145961
Ki 310±n/a nM
Citation Pagé, DNguyen, NBernard, SCoupal, MGosselin, MLepage, JAdam, LBrown, W New scaffolds in the development of mu opioid-receptor ligands. Bioorg Med Chem Lett13:1585-9 (2003) Kappa-type opioid receptor
Name:Kappa-type opioid receptor
Type:G Protein-Coupled Receptor (GPCR)
Mol. Mass.:42648.76
Organism:Homo sapiens (Human)
Description:P41145
Residue:380
BDBM50127345
NameBDBM50127345
Synonyms:(S)-3-[(3-Phenyl-ureido)-methyl]-3,4-dihydro-1H-isoquinoline-2-carbothioic acid ((R)-1-pyrrolidin-2-ylmethyl)-amide | CHEMBL39968
TypeSmall organic molecule
Emp. Form.C23H29N5OS
Mol. Mass.423.574
SMILESO=C(NC[C@@H]1Cc2ccccc2CN1C(=S)NC[C@H]1CCCN1)Nc1ccccc1