Reaction Details
TargetKappa-type opioid receptor
LigandBDBM50127337
Substrate/Competitorn/a
Meas. Tech.ChEBML_145961
Ki 530±n/a nM
Citation Pagé, DNguyen, NBernard, SCoupal, MGosselin, MLepage, JAdam, LBrown, W New scaffolds in the development of mu opioid-receptor ligands. Bioorg Med Chem Lett13:1585-9 (2003) Kappa-type opioid receptor
Name:Kappa-type opioid receptor
Type:G Protein-Coupled Receptor (GPCR)
Mol. Mass.:42648.76
Organism:Homo sapiens (Human)
Description:P41145
Residue:380
BDBM50127337
NameBDBM50127337
Synonyms:(S)-3-[(3-Phenyl-ureido)-methyl]-3,4-dihydro-1H-isoquinoline-2-carbothioic acid [(R)-1-(4-hydroxy-benzyl)-pyrrolidin-2-ylmethyl]-amide | CHEMBL40548
TypeSmall organic molecule
Emp. Form.C30H35N5O2S
Mol. Mass.529.696
SMILESOc1ccc(CN2CCC[C@@H]2CNC(=S)N2Cc3ccccc3C[C@H]2CNC(=O)Nc2ccccc2)cc1