Reaction Details
TargetKappa-type opioid receptor
LigandBDBM50101623
Substrate/Competitorn/a
Meas. Tech.ChEBML_145961
Ki>1000±n/a nM
Citation Pagé, DNguyen, NBernard, SCoupal, MGosselin, MLepage, JAdam, LBrown, W New scaffolds in the development of mu opioid-receptor ligands. Bioorg Med Chem Lett13:1585-9 (2003) Kappa-type opioid receptor
Name:Kappa-type opioid receptor
Type:G Protein-Coupled Receptor (GPCR)
Mol. Mass.:42648.76
Organism:Homo sapiens (Human)
Description:P41145
Residue:380
BDBM50101623
NameBDBM50101623
Synonyms:(4-Hydroxy-2,6-dimethyl-phenyl)-[(1,2,3,4-tetrahydro-isoquinoline-3-carbonyl)-amino]-acetic acid | CHEMBL416788
TypeSmall organic molecule
Emp. Form.C20H22N2O4
Mol. Mass.354.3997
SMILESCc1cc(O)cc(C)c1C(NC(=O)C1Cc2ccccc2CN1)C(O)=O