Reaction Details
TargetKappa-type opioid receptor
LigandBDBM50127352
Substrate/Competitorn/a
Meas. Tech.ChEBML_145961
Ki>1000±n/a nM
Citation Pagé, DNguyen, NBernard, SCoupal, MGosselin, MLepage, JAdam, LBrown, W New scaffolds in the development of mu opioid-receptor ligands. Bioorg Med Chem Lett13:1585-9 (2003) Kappa-type opioid receptor
Name:Kappa-type opioid receptor
Type:G Protein-Coupled Receptor (GPCR)
Mol. Mass.:42648.76
Organism:Homo sapiens (Human)
Description:P41145
Residue:380
BDBM50127352
NameBDBM50127352
Synonyms:(S)-3-(3-tert-Butyl-ureidomethyl)-3,4-dihydro-1H-isoquinoline-2-carbothioic acid [(S)-1-(tetrahydro-furan-2-yl)methyl]-amide | CHEMBL41550
TypeSmall organic molecule
Emp. Form.C21H32N4O2S
Mol. Mass.404.569
SMILESCC(C)(C)NC(=O)NC[C@@H]1Cc2ccccc2CN1C(=S)NC[C@@H]1CCCO1