Reaction Details
Target72 kDa type IV collagenase
LigandBDBM50563341
Substrate/Competitorn/a
Meas. Tech.ChEMBL_2082102 (CHEMBL4737893)
Ki 0.250000±n/a nM
Citation Lenci, EAngeli, ACalugi, LInnocenti, RCarta, FSupuran, CTTrabocchi, A Multitargeting application of proline-derived peptidomimetics addressing cancer-related human matrix metalloproteinase 9 and carbonic anhydrase II. Eur J Med Chem214:0 (2021) 
 
72 kDa type IV collagenase
Name:72 kDa type IV collagenase
Type:Enzyme
Mol. Mass.:73870.36
Organism:Homo sapiens (Human)
Description: P08253
Residue:660
BDBM50563341
NameBDBM50563341
Synonyms:CHEMBL4800470
TypeSmall organic molecule
Emp. Form.C19H18N2O4S
Mol. Mass.370.422
SMILESONC(=O)[C@H]1CCCN1S(=O)(=O)c1ccc(cc1)C#Cc1ccccc1