Reaction Details
TargetMatrix metalloproteinase-9
LigandBDBM50127474
Substrate/Competitorn/a
Meas. Tech.ChEMBL_105385 (CHEMBL710804)
Ki>2128±n/a nM
Citation Cherney, RJDuan, JJVoss, MEChen, LWang, LMeyer, DTWasserman, ZRHardman, KDLiu, RQCovington, MBQian, MMandlekar, SChrist, DDTrzaskos, JMNewton, RCMagolda, RLWexler, RRDecicco, CP Design, synthesis, and evaluation of benzothiadiazepine hydroxamates as selective tumor necrosis factor-alpha converting enzyme inhibitors. J Med Chem46:1811-23 (2003) 
 
Matrix metalloproteinase-9
Name:Matrix metalloproteinase-9
Type:Enzyme
Mol. Mass.:78452.28
Organism:Homo sapiens (Human)
Description:P14780
Residue:707
BDBM50127474
NameBDBM50127474
Synonyms:6-Amino-2-[7-(3,5-dimethoxy-benzyloxy)-1,1-dioxo-1,3,4,5-tetrahydro-1lambda*6*-benzo[f][1,2,5]thiadiazepin-2-yl]-hexanoic acid hydroxyamide | CHEMBL51557
TypeSmall organic molecule
Emp. Form.C23H32N4O7S
Mol. Mass.508.588
SMILESCOc1cc(COc2ccc3c(NCCN([C@H](CCCCN)C(=O)NO)S3(=O)=O)c2)cc(OC)c1