Reaction Details
TargetMatrix metalloproteinase-9
LigandBDBM50127466
Substrate/Competitorn/a
Meas. Tech.ChEMBL_105385 (CHEMBL710804)
Ki 118±n/a nM
Citation Cherney, RJDuan, JJVoss, MEChen, LWang, LMeyer, DTWasserman, ZRHardman, KDLiu, RQCovington, MBQian, MMandlekar, SChrist, DDTrzaskos, JMNewton, RCMagolda, RLWexler, RRDecicco, CP Design, synthesis, and evaluation of benzothiadiazepine hydroxamates as selective tumor necrosis factor-alpha converting enzyme inhibitors. J Med Chem46:1811-23 (2003) 
 
Matrix metalloproteinase-9
Name:Matrix metalloproteinase-9
Type:Enzyme
Mol. Mass.:78452.28
Organism:Homo sapiens (Human)
Description:P14780
Residue:707
BDBM50127466
NameBDBM50127466
Synonyms:CHEMBL299141 | {5-[7-(3,5-Dimethoxy-benzyloxy)-1,1-dioxo-1,3,4,5-tetrahydro-1lambda*6*-benzo[f][1,2,5]thiadiazepin-2-yl]-5-hydroxycarbamoyl-pentyl}-carbamic acid tert-butyl ester
TypeSmall organic molecule
Emp. Form.C28H40N4O9S
Mol. Mass.608.704
SMILESCOc1cc(COc2ccc3c(NCCN([C@H](CCCCNC(=O)OC(C)(C)C)C(=O)NO)S3(=O)=O)c2)cc(OC)c1