Reaction Details
TargetInterstitial collagenase
LigandBDBM50127475
Substrate/Competitorn/a
Meas. Tech.ChEMBL_106136 (CHEMBL718683)
Ki>4949.0±n/a nM
Citation Cherney, RJDuan, JJVoss, MEChen, LWang, LMeyer, DTWasserman, ZRHardman, KDLiu, RQCovington, MBQian, MMandlekar, SChrist, DDTrzaskos, JMNewton, RCMagolda, RLWexler, RRDecicco, CP Design, synthesis, and evaluation of benzothiadiazepine hydroxamates as selective tumor necrosis factor-alpha converting enzyme inhibitors. J Med Chem46:1811-23 (2003) 
 
Interstitial collagenase
Name:Interstitial collagenase
Type:Enzyme
Mol. Mass.:54010.26
Organism:Homo sapiens (Human)
Description: P03956
Residue:469
BDBM50127475
NameBDBM50127475
Synonyms:2-(7-Benzyloxy-1,1-dioxo-1,3,4,5-tetrahydro-1lambda*6*-benzo[f][1,2,5]thiadiazepin-2-yl)-N-hydroxy-propionamide | CHEMBL52423
TypeSmall organic molecule
Emp. Form.C18H21N3O5S
Mol. Mass.391.441
SMILESC[C@@H](N1CCNc2cc(OCc3ccccc3)ccc2S1(=O)=O)C(=O)NO