Reaction Details
Target72 kDa type IV collagenase
LigandBDBM50127476
Substrate/Competitorn/a
Meas. Tech.ChEMBL_104404 (CHEMBL715007)
Ki 8±n/a nM
Citation Cherney, RJDuan, JJVoss, MEChen, LWang, LMeyer, DTWasserman, ZRHardman, KDLiu, RQCovington, MBQian, MMandlekar, SChrist, DDTrzaskos, JMNewton, RCMagolda, RLWexler, RRDecicco, CP Design, synthesis, and evaluation of benzothiadiazepine hydroxamates as selective tumor necrosis factor-alpha converting enzyme inhibitors. J Med Chem46:1811-23 (2003) 
 
72 kDa type IV collagenase
Name:72 kDa type IV collagenase
Type:Enzyme
Mol. Mass.:73870.36
Organism:Homo sapiens (Human)
Description: P08253
Residue:660
BDBM50127476
NameBDBM50127476
Synonyms:CHEMBL54021 | N-Hydroxy-2-(7-methoxy-1,1-dioxo-1,3,4,5-tetrahydro-1lambda*6*-benzo[f][1,2,5]thiadiazepin-2-yl)-propionamide
TypeSmall organic molecule
Emp. Form.C12H17N3O5S
Mol. Mass.315.345
SMILESCOc1ccc2c(NCCN([C@H](C)C(=O)NO)S2(=O)=O)c1