Reaction Details
TargetDisintegrin and metalloproteinase domain-containing protein 17
LigandBDBM50127458
Substrate/Competitorn/a
Meas. Tech.ChEMBL_212590 (CHEMBL813237)
Ki 71±n/a nM
Citation Cherney, RJDuan, JJVoss, MEChen, LWang, LMeyer, DTWasserman, ZRHardman, KDLiu, RQCovington, MBQian, MMandlekar, SChrist, DDTrzaskos, JMNewton, RCMagolda, RLWexler, RRDecicco, CP Design, synthesis, and evaluation of benzothiadiazepine hydroxamates as selective tumor necrosis factor-alpha converting enzyme inhibitors. J Med Chem46:1811-23 (2003) 
 
Disintegrin and metalloproteinase domain-containing protein 17
Name:Disintegrin and metalloproteinase domain-containing protein 17
Type:Enzyme
Mol. Mass.:93007.89
Organism:Homo sapiens (Human)
Description:
Residue:824
BDBM50127458
NameBDBM50127458
Synonyms:CHEMBL300394 | N-Hydroxy-2-(7-methoxy-1,1-dioxo-1,3,4,5-tetrahydro-1lambda*6*-benzo[f][1,2,5]thiadiazepin-2-yl)-3-methyl-butyramide
TypeSmall organic molecule
Emp. Form.C14H21N3O5S
Mol. Mass.343.399
SMILESCOc1ccc2c(NCCN([C@H](C(C)C)C(=O)NO)S2(=O)=O)c1