Reaction Details
TargetProstaglandin G/H synthase 1
LigandBDBM22369
Substrate/Competitorn/a
Meas. Tech.ChEBML_158746
IC50>500000±n/a nM
Citation Pal, MRao Veeramaneni, VNagabelli, MRao Kalleda, SMisra, PRao Casturi, SRao Yeleswarapu, K Conformationally restricted 3,4-diarylfuranones (2,3a,4,5-tetrahydronaphthofuranones) as selective cyclooxygenase-2 inhibitors. Bioorg Med Chem Lett13:1639-43 (2003) Prostaglandin G/H synthase 1
Name:Prostaglandin G/H synthase 1
Type:Enzyme
Mol. Mass.:68692.62
Organism:Homo sapiens (Human)
Description:P23219
Residue:599
BDBM22369
NameBDBM22369
Synonyms:4-(4-methanesulfonylphenyl)-3-phenyl-2,5-dihydrofuran-2-one MK 0966 US11478464, Compound Rofecoxib | US11786535, Compound Rofecoxib
TypeSmall organic molecule
Emp. Form.C17H14O4S
Mol. Mass.314.356
SMILESCS(=O)(=O)c1ccc(cc1)C1=C(C(=O)OC1)c1ccccc1