Reaction Details
TargetCasein kinase I isoform epsilon
LigandBDBM50364141
Substrate/Competitorn/a
Meas. Tech.ChEMBL_2083577 (CHEMBL4739368)
IC50 7.7±n/a nM
Citation Grieco, IBissaro, MTiz, DBPerez, DIPerez, CMartinez, ARedenti, SMariotto, EBortolozzi, RViola, GCozza, GSpalluto, GMoro, SFederico, S Developing novel classes of protein kinase CK1? inhibitors by fusing [1,2,4]triazole with different bicyclic heteroaromatic systems. Eur J Med Chem216:0 (2021) 
 
Casein kinase I isoform epsilon
Name:Casein kinase I isoform epsilon
Type:Protein
Mol. Mass.:47340.25
Organism:Homo sapiens (Human)
Description:P49674
Residue:416
BDBM50364141
NameBDBM50364141
Synonyms:CHEMBL1951415
TypeSmall organic molecule
Emp. Form.C19H20FN5
Mol. Mass.337.394
SMILESNc1nccc(n1)-c1c(ncn1C1CCCCC1)-c1ccc(F)cc1