Reaction Details
TargetCasein kinase I isoform delta
LigandBDBM50563723
Substrate/Competitorn/a
Meas. Tech.ChEMBL_2083579 (CHEMBL4739370)
IC50 3.9±n/a nM
Citation Grieco, IBissaro, MTiz, DBPerez, DIPerez, CMartinez, ARedenti, SMariotto, EBortolozzi, RViola, GCozza, GSpalluto, GMoro, SFederico, S Developing novel classes of protein kinase CK1? inhibitors by fusing [1,2,4]triazole with different bicyclic heteroaromatic systems. Eur J Med Chem216:0 (2021) 
 
Casein kinase I isoform delta
Name:Casein kinase I isoform delta
Type:Enzyme
Mol. Mass.:47356.76
Organism:Homo sapiens (Human)
Description:P48730
Residue:415
BDBM50563723
NameBDBM50563723
Synonyms:CHEMBL4128865
TypeSmall organic molecule
Emp. Form.C22H22FN7O
Mol. Mass.419.4548
SMILESNc1nccc(n1)-c1c(ncn1C1CCN(Cc2ccon2)CC1)-c1ccc(F)cc1