Reaction Details
TargetEndothelin-1 receptor
LigandBDBM50127760
Substrate/Competitorn/a
Meas. Tech.ChEBML_64198
Ki 2±n/a nM
Citation Lange, UEBraje, WMAmberg, WKettschau, G Solid-phase synthesis of endothelin receptor antagonists. Bioorg Med Chem Lett13:1721-4 (2003) Endothelin-1 receptor
Name:Endothelin-1 receptor
Type:Enzyme Catalytic Domain
Mol. Mass.:48736.88
Organism:Homo sapiens (Human)
Description:P25101
Residue:427
BDBM50127760
NameBDBM50127760
Synonyms:2-[4-(4-Ethoxy-phenyl)-6-methyl-pyrimidin-2-yloxy]-3,3-diphenyl-butyric acid | CHEMBL46311
TypeSmall organic molecule
Emp. Form.C29H28N2O4
Mol. Mass.468.5436
SMILESCCOc1ccc(cc1)-c1cc(C)nc(OC(C(O)=O)C(C)(c2ccccc2)c2ccccc2)n1