Reaction Details
TargetHigh affinity nerve growth factor receptor
LigandBDBM50142026
Substrate/Competitorn/a
Meas. Tech.ChEMBL_2084555 (CHEMBL4765818)
IC50 2.0±n/a nM
Citation Tammiku-Taul, JPark, RJaanson, KLuberg, KDobchev, DAKananovich, DNoole, AMandel, MKaasik, ALopp, MTimmusk, TKarelson, M Indole-like Trk receptor antagonists. Eur J Med Chem121:541-552 (2016) 
 
High affinity nerve growth factor receptor
Name:High affinity nerve growth factor receptor
Type:n/a
Mol. Mass.:87498.18
Organism:Homo sapiens (Human)
Description:P04629
Residue:796
BDBM50142026
NameBDBM50142026
Synonyms:3-((1-methyl-1H-indol-3-yl)methylene)-1H-pyrrolo[3,2-b]pyridin-2(3H)-one CHEMBL176544
TypeSmall organic molecule
Emp. Form.C17H13N3O
Mol. Mass.275.3046
SMILESCn1cc(\C=C2/C(=O)Nc3cccnc23)c2ccccc12